{"text_format":"1","workbook":"xlsx","n_sheets":14,"sheets":["Cover","BudgetSum 2-3","CashSum 4","EstRev 5-10","EstExp 11-17","Itemize 18","DeficitBudgetSum Calc 19","DefReductPlan 20-24","Bckgrnd-Assumpt 25-26","AC 27","VendContract 28","Ref 29","Balancing","B15"],"not_rendered":{"charts":0,"images":0,"macros":1,"external_links":0,"defined_names":15,"comments":4,"pivot_tables":0},"unopened":[],"bounds":{"document_bytes":16777216,"sheet_cells":100000,"rows_first":2000,"rows_last":500,"rows_between":2000,"halvings":0,"cell_chars":16384,"cell_head_chars":4096},"cells_cut":0,"cells_raw":0,"read":"whole","date_system":"1900"}

{"sheet":"Cover","index":0,"n_rows":63,"n_cols":17,"rows_kept":63,"cut":false,"hidden":false,"merged":[[0,5,0,12],[2,5,2,12],[3,5,3,12],[1,5,1,12],[23,12,23,15],[2,13,12,17],[12,6,12,11],[13,6,13,11],[4,5,4,12],[9,6,9,8],[40,3,40,8],[40,9,40,14],[41,3,41,8],[10,6,10,8],[30,12,30,13],[24,7,24,9],[23,3,23,9],[27,3,27,5],[24,12,24,15],[26,7,26,15],[15,0,17,17],[32,8,32,10],[36,3,36,4],[41,9,41,14],[32,3,32,5],[35,14,35,15],[52,3,52,14],[46,9,46,14],[46,3,46,8],[49,9,49,14],[47,3,47,8],[47,9,47,14],[48,3,48,8],[49,3,49,8],[50,9,50,14],[50,3,50,8],[48,9,48,14],[42,3,42,8],[42,9,42,14],[43,9,43,14],[44,3,44,8],[44,9,44,14],[43,3,43,8],[45,3,45,8],[45,9,45,14]]}
[null,null,null,null,null,"ILLINOIS STATE BOARD OF EDUCATION"]
[null,null,null,null,null,"School Business Services Division"]
["Accounting Basis:",null,null,null,null,null,null,null,null,null,null,null,null,{"$f":"'DeficitBudgetSum Calc 19'!C9 & \" \"","v":"Unbalanced budget, however, a deficit reduction plan is not required at this time. "}]
[null,null,null,null,null,"SCHOOL DISTRICT BUDGET FORM *"]
[null,"X","Cash",null,null,"July 1, 2014 - June 30, 2015"]
[null,null,"Accrual"]
[]
[]
[]
[null,null,"Date of Amended Budget:"]
{"$rows_left_out":54}
{"sheet":"BudgetSum 2-3","index":1,"n_rows":95,"n_cols":12,"rows_kept":95,"cut":false,"hidden":false,"merged":[]}
["Begin entering data on EstRev 5-10 and EstExp 11-17 tabs.",null,"(10)","(20)","(30)","(40)","(50)","(60)","(70)","(80)","(90)"]
[{"$f":"'EstRev 5-10'!A2","v":"Description"},"Acct #","  Educational   ","Operations & Maintenance","Debt Service","Transportation","   Municipal Retirement/ Social Security","Capital Projects","Working Cash","Tort","Fire Prevention & Safety"]
["ESTIMATED BEGINNING FUND BALANCE July 1, 2014 1",null,203192,355,158205,26619,42132,57613,158368,46143,1114]
["RECEIPTS/REVENUES"]
["LOCAL SOURCES",1000,{"$f":"'EstRev 5-10'!C109","v":1657749},{"$f":"'EstRev 5-10'!D109","v":246899},{"$f":"'EstRev 5-10'!E109","v":543268},{"$f":"'EstRev 5-10'!F109","v":98025},{"$f":"'EstRev 5-10'!G109","v":139891},{"$f":"'EstRev 5-10'!H109","v":0},{"$f":"'EstRev 5-10'!I109","v":13637},{"$f":"'EstRev 5-10'!J109","v":89971},{"$f":"'EstRev 5-10'!K109","v":1105}]
["FLOW-THROUGH RECEIPTS/REVENUES FROM ONE                                 DISTRICT TO ANOTHER DISTRICT",2000,{"$f":"'EstRev 5-10'!C114","v":0},{"$f":"'EstRev 5-10'!D114","v":0},null,{"$f":"'EstRev 5-10'!F114","v":0},{"$f":"'EstRev 5-10'!G114","v":0}]
["STATE SOURCES",3000,{"$f":"'EstRev 5-10'!C173","v":434000},{"$f":"'EstRev 5-10'!D173","v":0},{"$f":"'EstRev 5-10'!E173","v":0},{"$f":"'EstRev 5-10'!F173","v":155000},{"$f":"'EstRev 5-10'!G173","v":0},{"$f":"'EstRev 5-10'!H173","v":0},{"$f":"'EstRev 5-10'!I173","v":0},{"$f":"'EstRev 5-10'!J173","v":0},{"$f":"'EstRev 5-10'!K173","v":0}]
["FEDERAL SOURCES",4000,{"$f":"'EstRev 5-10'!C273","v":152562},{"$f":"'EstRev 5-10'!D273","v":0},{"$f":"'EstRev 5-10'!E273","v":0},{"$f":"'EstRev 5-10'!F273","v":0},{"$f":"'EstRev 5-10'!G273","v":0},{"$f":"'EstRev 5-10'!H273","v":0},{"$f":"'EstRev 5-10'!I273","v":0},{"$f":"'EstRev 5-10'!J273","v":0},{"$f":"'EstRev 5-10'!K273","v":0}]
["Total Direct Receipts/Revenues 8",null,{"$f":"SUM(C5:C8)","v":2244311},{"$f":"SUM(D5:D8)","v":246899},543268,253025,139891,0,13637,89971,1105]
["Receipts/Revenues for \"On Behalf\" Payments 2",3998,422964,0,0,0,0,0,null,0,0]
{"$rows_left_out":86}
{"sheet":"CashSum 4","index":2,"n_rows":21,"n_cols":11,"rows_kept":21,"cut":false,"hidden":false,"merged":[[0,1,1,1],[3,0,3,1],[20,0,20,1],[10,0,10,1],[12,0,12,1],[18,0,18,1],[19,0,19,1]]}
[null,"Acct #","(10)","(20)","(30)","(40)","(50)","(60)","(70)","(80)","(90)"]
[{"$f":"'BudgetSum 2-3'!A2","v":"Description"},null,"  Educational   ","Operations & Maintenance","Debt Service","Transportation","   Municipal Retirement/ Social Security","Capital Projects","Working Cash","Tort","Fire Prevention & Safety"]
["BEGINNING CASH BALANCE ON HAND July 1, 2014 7",null,111829,21105,16046,57582,18141,7613,344760,14143,14]
["Total Direct Receipts & Other Sources 8",null,{"$f":"'BudgetSum 2-3'!C9+'BudgetSum 2-3'!C46","v":2494311},{"$f":"'BudgetSum 2-3'!D9+'BudgetSum 2-3'!D46","v":426899},{"$f":"'BudgetSum 2-3'!E9+'BudgetSum 2-3'!E46","v":543268},{"$f":"'BudgetSum 2-3'!F9+'BudgetSum 2-3'!F46","v":253025},{"$f":"'BudgetSum 2-3'!G9+'BudgetSum 2-3'!G46","v":139891},{"$f":"'BudgetSum 2-3'!H9+'BudgetSum 2-3'!H46","v":40000},{"$f":"'BudgetSum 2-3'!I9+'BudgetSum 2-3'!I46","v":1013637},{"$f":"'BudgetSum 2-3'!J9+'BudgetSum 2-3'!J46","v":89971},{"$f":"'BudgetSum 2-3'!K9+'BudgetSum 2-3'!K46","v":1105}]
["OTHER RECEIPTS"]
["Interfund Loans Payable (Loans from Other Funds)",411]
["Interfund Loans Receivable (Repayment of Loans)",141]
["Notes and Warrants Payable",433]
["Other Current Assets",199]
["Total Other Receipts",null,{"$f":"SUM(C6:C9)","v":0},{"$f":"SUM(D6:D9)","v":0},0,0,0,0,0,0,0]
{"$rows_left_out":12}
{"sheet":"EstRev 5-10","index":3,"n_rows":274,"n_cols":11,"rows_kept":274,"cut":false,"hidden":false,"merged":[[174,0,174,1],[177,0,177,1],[178,0,178,1],[184,0,184,1]]}
[null,null,"(10)","(20)","(30)","(40)","(50)","(60)","(70)","(80)","(90)"]
["Description","Acct      #","Educational     ","Operations & Maintenance","Debt Service","Transportation","Municipal Retirement/ Social Security","Capital Projects","Working Cash","Tort","Fire Prevention & Safety"]
["RECEIPTS/REVENUES FROM LOCAL SOURCES"]
["AD VALOREM TAXES LEVIED BY LOCAL EDUCATION AGENCY"]
["Designated Purposes Levies  11","­",1449535,246899,543268,81945,77890,null,13637,89971,1105]
["Leasing Purposes Levy 12 ",1130,14998]
["Special Education Purposes Levy",1140,11016]
["FICA and Medicare Only Levies",1150,null,null,null,null,62001]
["Area Vocational Construction Purposes Levy",1160]
["Summer School Purposes Levy",1170]
{"$rows_left_out":265}
{"sheet":"EstExp 11-17","index":4,"n_rows":355,"n_cols":11,"rows_kept":355,"cut":false,"hidden":false,"merged":[[114,0,114,1],[353,0,353,1],[287,0,287,1],[203,0,203,1]]}
[null,null,"(100)","(200)","(300)","(400)","(500)","(600)","(700)","(800)","(900)"]
[{"$f":"'EstRev 5-10'!A2","v":"Description"},"Funct #","Salaries","Employee Benefits","Purchased Services","Supplies & Materials","Capital Outlay","Other Objects","Non-Capitalized Equipment","Termination Benefits","Total"]
["10 - EDUCATIONAL FUND (ED)"]
["INSTRUCTION (ED)"]
["Regular Programs",1100,718553,92593,15700,51500,1000,900,null,null,{"$f":"SUM(C5:J5)","v":880246}]
["Tuition Payment to Charter Schools",1115,null,null,null,null,null,null,null,null,{"$f":"SUM(C6,E6)","v":0}]
["Pre-K Programs",1125,null,null,null,null,null,null,null,null,{"$f":"SUM(C7:J7)","v":0}]
["Special Education Programs (Functions 1200 - 1220)",1200,164559,19945,null,1000,null,null,null,null,185504]
["Special Education Programs Pre-K",1225,null,null,null,null,null,null,null,null,0]
["Remedial and Supplemental Programs K-12",1250,81110,9924,null,500,null,null,null,null,91534]
{"$rows_left_out":346}
{"sheet":"Itemize 18","index":5,"n_rows":9,"n_cols":2,"rows_kept":9,"cut":false,"hidden":false,"merged":[]}
[]
[null,"     This page is provided for detailed itemizations as requested within the body of the Report."]
[]
[]
[1,"Line 45, O&M Maintenance Grant, $40,000, Other Sources Classfied Elsewhere"]
[2,"Line 171, State Library Grant, $1,300 Revenue"]
[3,"Line 271, SRSA Grant (REAP), $30,000 Revenue"]
[4,"Line 164, Debt Service, Other, $1,100, Service Charges, Expenditures"]
[5,"Line 107, Other Local Revenues, $2,600, Wireless Royalties"]

{"sheet":"DeficitBudgetSum Calc 19","index":6,"n_rows":20,"n_cols":6,"rows_kept":20,"cut":false,"hidden":false,"merged":[[16,0,16,4],[8,2,8,5],[11,0,11,4],[12,0,12,4],[13,0,13,4]]}
[]
[{"$f":"Cover!G13&\"             \"&Cover!G14","v":"PAW PAW CUSD #271             47-052-2710-26"}]
["DEFICIT BUDGET SUMMARY INFORMATION - Operating Funds Only"]
[null,"EDUCATIONAL","OPERATIONS & MAINTENANCE","TRANSPORTATION","WORKING CASH","TOTAL"]
["Direct Revenues",{"$f":"'BudgetSum 2-3'!C9","v":2244311},{"$f":"'BudgetSum 2-3'!D9","v":246899},{"$f":"'BudgetSum 2-3'!F9","v":253025},{"$f":"'BudgetSum 2-3'!I9","v":13637},{"$f":"SUM(B5:E5)","v":2757872}]
["Direct Expenditures",{"$f":"'BudgetSum 2-3'!C19","v":2340084},{"$f":"'BudgetSum 2-3'!D19","v":328127},{"$f":"'BudgetSum 2-3'!F19","v":178934},null,{"$f":"SUM(B6:E6)","v":2847145}]
["Difference",{"$f":"(B5-B6)","v":-95773},{"$f":"(C5-C6)","v":-81228},{"$f":"(D5-D6)","v":74091},{"$f":"(E5-E6)","v":13637},{"$f":"SUM(F5-F6)","v":-89273}]
["Estimated Fund Balance - June 30, 2015",{"$f":"'BudgetSum 2-3'!C81","v":217419},{"$f":"'BudgetSum 2-3'!D81","v":59127},{"$f":"'BudgetSum 2-3'!F81","v":100710},{"$f":"'BudgetSum 2-3'!I81","v":922005},{"$f":"SUM(B8:E8)","v":1299261}]
[null,null,{"$f":"IF(AND(F7<0,F8>=0,ABS(F7*3)>ABS(F8)),A17,IF(AND(F7<0,F8>0,ABS(F7*3)<=ABS(F8)),A18,IF(AND(F7<0,F8<0),A17,IF(F8=0,A20,A19))))","v":"Unbalanced budget, however, a deficit reduction plan is not required at this time."}]
[]
{"$rows_left_out":11}
{"sheet":"DefReductPlan 20-24","index":7,"n_rows":27,"n_cols":26,"rows_kept":27,"cut":false,"hidden":false,"merged":[[1,22,1,25],[2,22,2,25],[0,22,0,25],[3,22,3,23],[0,2,0,6],[1,17,1,21],[2,17,2,21],[3,19,3,20],[2,2,2,6],[1,12,1,16],[1,2,1,6],[25,0,25,1],[26,0,26,1],[12,0,12,1],[21,0,21,1],[20,0,20,1],[6,0,6,1],[2,12,2,16],[3,14,3,15],[1,7,1,11],[2,7,2,11],[3,9,3,10]]}
[null,null,"DEFICIT REDUCTION PLAN",null,null,null,null,null,null,null,null,null,null,null,null,null,null,null,null,null,null,null,"SUMMARY"]
[null,null,"ESTIMATED BUDGET",null,null,null,null,"ESTIMATED BUDGET",null,null,null,null,"ESTIMATED BUDGET",null,null,null,null,"ESTIMATED BUDGET",null,null,null,null,"BUDGET ADDENDUM - DEFICIT REDUCTION PLAN"]
[{"$f":"Cover!G13&\"         \"&Cover!G14","v":"PAW PAW CUSD #271         47-052-2710-26"},null,"FY2014-15",null,null,null,null,"FY2015-16",null,null,null,null,"FY2016-17",null,null,null,null,"FY2017-18",null,null,null,null,"ESTIMATED BUDGET"]
["District Number",null,null,null,null,null,null,null,null,null,null,null,null,null,null,null,null,null,null,null,null,null,"Date of Adoption:"]
[null,null,null,null,null,null,null,null,null,null,null,null,null,null,null,null,null,null,null,null,null,null,null,null,"(Enter as MM/DD/YY)"]
[null,null,"Educational Fund","Operations & Maintenance Fund","Transportation Fund","Working Cash Fund","Total","Educational Fund","Operations & Maintenance Fund","Transportation Fund","Working Cash Fund","Total","Educational Fund","Operations & Maintenance Fund","Transportation Fund","Working Cash Fund","Total","Educational Fund","Operations & Maintenance Fund","Transportation Fund","Working Cash Fund","Total","FY2014-15","FY2015-16","FY2016-17","FY2017-18"]
["ESTIMATED BEGINNING FUND BALANCE                                                (must equal prior Ending Fund Balance)",null,{"$f":"'BudgetSum 2-3'!C3","v":203192},{"$f":"'BudgetSum 2-3'!D3","v":355},{"$f":"'BudgetSum 2-3'!F3","v":26619},{"$f":"'BudgetSum 2-3'!I3","v":158368},{"$f":"SUM(C7:F7)","v":388534},{"$f":"C27","v":217419},{"$f":"D27","v":59127},{"$f":"E27","v":100710},{"$f":"F27","v":922005},{"$f":"SUM(H7:K7)","v":1299261},{"$f":"H27","v":217419},{"$f":"I27","v":59127},{"$f":"J27","v":100710},{"$f":"K27","v":922005},{"$f":"SUM(M7:P7)","v":1299261},{"$f":"M27","v":217419},{"$f":"N27","v":59127},{"$f":"O27","v":100710},{"$f":"P27","v":922005},{"$f":"SUM(R7:U7)","v":1299261},{"$f":"G7","v":388534},{"$f":"L7","v":1299261},{"$f":"Q7","v":1299261},{"$f":"V7","v":1299261}]
["  RECEIPTS/REVENUES","Acct No."]
["LOCAL SOURCES",1000,{"$f":"'BudgetSum 2-3'!C5","v":1657749},{"$f":"'BudgetSum 2-3'!D5","v":246899},{"$f":"'BudgetSum 2-3'!F5","v":98025},{"$f":"'BudgetSum 2-3'!I5","v":13637},{"$f":"SUM(C9:F9)","v":2016310},null,null,null,null,{"$f":"SUM(H9:K9)","v":0},null,null,null,null,{"$f":"SUM(M9:P9)","v":0},null,null,null,null,{"$f":"SUM(R9:U9)","v":0},{"$f":"G9","v":2016310},{"$f":"L9","v":0},{"$f":"Q9","v":0},{"$f":"V9","v":0}]
["FLOW-THROUGH RECEIPTS/REVENUES FROM ONE                           DISTRICT TO ANOTHER DISTRICT",2000,{"$f":"'BudgetSum 2-3'!C6","v":0},{"$f":"'BudgetSum 2-3'!D6","v":0},{"$f":"'BudgetSum 2-3'!F6","v":0},null,{"$f":"SUM(C10:F10)","v":0},null,null,null,null,0,null,null,null,null,{"$f":"SUM(M10:P10)","v":0},null,null,null,null,{"$f":"SUM(R10:U10)","v":0},{"$f":"G10","v":0},{"$f":"L10","v":0},{"$f":"Q10","v":0},{"$f":"V10","v":0}]
{"$rows_left_out":18}
{"sheet":"Bckgrnd-Assumpt 25-26","index":8,"n_rows":33,"n_cols":2,"rows_kept":33,"cut":false,"hidden":false,"merged":[]}
[null,"Deficit Reduction Plan-Background/Assumptions"]
[null,"Fiscal Year 2015 through Fiscal Year 2018"]
[]
[null,{"$f":"Cover!G13&\"              \"&Cover!G14","v":"PAW PAW CUSD #271              47-052-2710-26"}]
[null,"Please complete the following schedule and include a brief description to identify any areas of the budget that will be impacted from one year to the next.  If the deficit reduction plan relies upon new local revenues, identify contingencies for further budget reductions which will be enacted in the event those new revenues are not available.  For additional information, please see: "]
[null,"www.isbe.net/sfms/budget/2014/budget.htm"]
[]
[1,"Background and Narrative of Budget Reductions:"]
[]
[]
{"$rows_left_out":24}
{"sheet":"AC 27","index":9,"n_rows":28,"n_cols":10,"rows_kept":28,"cut":false,"hidden":false,"merged":[[2,0,2,9],[1,0,1,9],[15,0,15,3],[13,0,14,4],[13,7,13,9],[14,7,14,9],[11,7,11,9],[27,2,27,3],[25,2,25,3],[16,4,16,6],[16,7,16,9]]}
[0]
["ESTIMATED LIMITATION OF ADMINISTRATIVE COSTS"]
["(For Local Use Only)"]
["This is an estimated Limitation of Administrative Costs Worksheet only and will not be accepted for Official Submission of the Limitation of"]
["Administrative Costs Worksheet.    "]
[]
["The worksheet is intended for use during the budgeting process  to estimate the district's percent increase of FY2015 budgeted expenditures over FY2014 actual expenditures.  "]
["Budget information is copied to this page.  Insert the prior year estimated actual expenditures to compute the estimated percentage increase (decrease)."]
[]
["The official Limitation of Administrative Costs Worksheet is attached to the end of the Annual",null,null,null,null,null,null,"An official Limitation of Administrative Costs Worksheet can"]
{"$rows_left_out":19}
{"sheet":"VendContract 28","index":10,"n_rows":12,"n_cols":6,"rows_kept":12,"cut":false,"hidden":false,"merged":[[4,0,4,5],[0,0,0,5]]}
["REPORTING OF PUBLIC VENDOR CONTRACTS OF $1,000 OR MORE"]
[]
[]
[{"$f":"Cover!G13& \"      \"& Cover!G14","v":"PAW PAW CUSD #271      47-052-2710-26"}]
["In accordance with the School Code, Section 10-20.21, all school districts are required to file a report listing ‘vendor contracts’ as an attachment to their budget.   In this context, the term \"vendor contracts\" refers to \"all contracts and agreements that pertain to goods and services that were intended to generate additional revenue and other remunerations for the school district in excess of $1,000, including without limitation vending machine contracts, sports and other attire, class rings, and photographic services.  The report is to list information regarding such contracts for the fiscal year immediately preceding the fiscal year of the budget.  All such contracts executed on or after July 1, 2007 must be approved by the school board."]
["  See:  School Code, Section 10-20.21 - Contracts"]
["(Sheet is unprotected and can be re-formatted as needed, but must be used for submission)"]
["Name of Vendor","Product or Service Provided","Net Revenue","Non-Monetary Remuneration","Purpose of Proceeds","Distribution Method and Recipient of Non-Monetary Remunerations Distributed"]
["Fannie Mae","Candy",1222,null,"Prom Fundraising"]
[null,null,null,null,"Class of 2015"]
{"$rows_left_out":3}
{"sheet":"Ref 29","index":11,"n_rows":40,"n_cols":2,"rows_kept":40,"cut":false,"hidden":false,"merged":[]}
[null,"Reference Description"]
[]
[1,"Each fund balance should correspond to the fund balance reflected on the books as of June 30th - Balance Sheet Accounts #720 and #730 (audit figures, if available)."]
[]
[2,"Accounting and Financial Reporting for Certain Grants and Other Financial Assistance.  The \"On-Behalf\" Payments should only be reflected on this page (Budget Summary, Lines 10 and 20)."]
[]
[3,"Requires the secretary of the school board to notify the county clerk (within 30 days of the transfer approval) to abate an equal amount of taxes to be next extended.  See Sec. 10-22.14 & 17-2.11."]
["3a","Requires notification to the county clerk to abate an equal amount from taxes next extended.  See section 10-22.14"]
[4,"Principal on Bonds Sold:"]
[null,"(1)  Funding Bonds are to be entered in the fund or funds in which the liability occurs."]
{"$rows_left_out":31}
{"sheet":"Balancing","index":12,"n_rows":43,"n_cols":3,"rows_kept":43,"cut":false,"hidden":false,"merged":[[28,1,28,2],[38,1,38,2],[0,0,0,2],[1,0,1,2],[2,0,2,2],[3,0,3,2],[18,1,18,2],[9,1,9,2]]}
["CHECK FOR ERRORS"]
["This worksheet checks various cells to assure that selected items are in balance."]
["Out-of-balance conditions are accompanied by an error message."]
["Errors must be corrected before the budget is finalized and submitted to ISBE."]
[null,"Budget Item References","Message"]
[null,"Is Deficit Reduction Plan Required?",{"$f":"IF(AND('DeficitBudgetSum Calc 19'!F7<0,'DeficitBudgetSum Calc 19'!F8>=0,ABS('DeficitBudgetSum Calc 19'!F7*3)>ABS('DeficitBudgetSum Calc 19'!F8)),'DeficitBudgetSum Calc 19'!F17,IF(AND('DeficitBudgetSum Calc 19'!F7<0,'DeficitBudgetSum Calc 19'!F8>0,ABS('DeficitBudgetSum Calc 19'!F7*3)<=ABS('DeficitBudgetSum Calc 19'!F8)),'DeficitBudgetSum Calc 19'!F18,IF(AND('DeficitBudgetSum Calc 19'!F7<0,'DeficitBudgetSum Calc 19'!F8<0),'DeficitBudgetSum Calc 19'!F17,IF('DeficitBudgetSum Calc 19'!F8=0,'DeficitBudgetSum Calc 19'!F20,'DeficitBudgetSum Calc 19'!F19))))","v":"Deficit reduction plan is not required."}]
[null,"If required, is Deficit Reduction Plan Completed (Page:  DefReductPlan 20-24)?",{"$f":"IF(AND(C6='DeficitBudgetSum Calc 19'!F17,'DefReductPlan 20-24'!Z22>0),\"Budget Plan Completed\",IF(AND(C6='DeficitBudgetSum Calc 19'!F17,'DefReductPlan 20-24'!Z22=0),\"Please complete the deficit reduction plan prior to submission.\",\"\"))","v":""}]
[1,"Cover Page - CASH or  ACCRUAL"]
[null,"Check one type of Accounting Basis used on the Cover sheet.",{"$f":"IF(Cover!B5=\"X\",\"CASH\",IF(Cover!B6=\"X\",\"ACCRUAL \",\"PLEASE CHECK AN ACCOUNTING BASIS.\"))","v":"CASH"}]
[2,"Budget Summary:  Other Sources (Page BudgetSum 2-3 - Acct 7000), must equal Other Uses (BudgetSum 2-3 - Acct. 8000)."]
{"$rows_left_out":34}
{"sheet":"B15","index":13,"n_rows":7999,"n_cols":5,"rows_kept":7999,"cut":false,"hidden":true,"merged":[]}
["School District Name",{"$f":"Cover!G13","v":"PAW PAW CUSD #271"}]
["School District ID",{"$f":"Cover!G14","v":"47-052-2710-26"}]
["School District/Joint Agreement","S"]
["Accounting Basis",{"$f":"Balancing!C9","v":"CASH"}]
[1,{"$f":"'BudgetSum 2-3'!C18","v":0},{"$f":"A5-B5","v":1}]
[2,{"$f":"'BudgetSum 2-3'!D18","v":0},{"$f":"A6-B6","v":2}]
[3,{"$f":"'BudgetSum 2-3'!E18","v":0},3]
[4,{"$f":"'BudgetSum 2-3'!F18","v":0},4]
[5,{"$f":"'BudgetSum 2-3'!G18","v":0},5]
[6,{"$f":"'BudgetSum 2-3'!H18","v":0},6]
{"$rows_left_out":7989}